{"text_format":"1","workbook":"xlsx","n_sheets":2,"sheets":["Main","설정"],"not_rendered":{"charts":0,"images":0,"macros":1,"external_links":0,"defined_names":0,"comments":0,"pivot_tables":0},"unopened":[],"bounds":{"document_bytes":16777216,"sheet_cells":100000,"rows_first":2000,"rows_last":500,"rows_between":2000,"halvings":0,"cell_chars":16384,"cell_head_chars":4096},"cells_cut":0,"cells_raw":0,"read":"whole","date_system":"1900"}

{"sheet":"Main","index":0,"n_rows":19,"n_cols":4,"rows_kept":19,"cut":false,"hidden":false,"merged":[[3,1,3,3]]}
["오늘 날짜",{"$f":"NOW()","v":"2018-10-16T20:01:32.620"}]
[]
["지금 하는 일","엑셀월드"]
[null,{"$f":"IFERROR(TEXT(C6-B6,\"[h]:mm\"),TEXT(B1-B6,\"[h]:mm\"))","v":"0:21"}]
[]
[null,43387.645185185182,43387.66038854167]
["체크","뭐하지?","세부분류","시간"]
[null,"취업공고 체크",{"$f":"IFERROR(VLOOKUP(B8,설정!$A:$B,2,FALSE),\"\")","v":"습관_평일"}]
[null,"수업복습",{"$f":"IFERROR(VLOOKUP(B9,설정!$A:$B,2,FALSE),\"\")","v":"습관_평일"}]
[null,"민병철유폰",{"$f":"IFERROR(VLOOKUP(B10,설정!$A:$B,2,FALSE),\"\")","v":"습관_평일"}]
[null,"어쩌다코딩",{"$f":"IFERROR(VLOOKUP(B11,설정!$A:$B,2,FALSE),\"\")","v":"코딩"}]
[null,"엑셀월드",{"$f":"IFERROR(VLOOKUP(B12,설정!$A:$B,2,FALSE),\"\")","v":"글쓰기"},2.1527777777777781E-2]
[null,"SQL강의",{"$f":"IFERROR(VLOOKUP(B13,설정!$A:$B,2,FALSE),\"\")","v":"공부"},1.4583333333333332E-2]
[null,null,{"$f":"IFERROR(VLOOKUP(B14,설정!$A:$B,2,FALSE),\"\")","v":""}]
[null,null,{"$f":"IFERROR(VLOOKUP(B15,설정!$A:$B,2,FALSE),\"\")","v":""}]
[null,null,{"$f":"IFERROR(VLOOKUP(B16,설정!$A:$B,2,FALSE),\"\")","v":""}]
[null,null,{"$f":"IFERROR(VLOOKUP(B17,설정!$A:$B,2,FALSE),\"\")","v":""}]
[null,null,{"$f":"IFERROR(VLOOKUP(B18,설정!$A:$B,2,FALSE),\"\")","v":""}]
[null,null,{"$f":"IFERROR(VLOOKUP(B19,설정!$A:$B,2,FALSE),\"\")","v":""}]

{"sheet":"설정","index":1,"n_rows":7,"n_cols":2,"rows_kept":7,"cut":false,"hidden":false,"merged":[]}
["뭐하지?","세부분류"]
["취업공고 체크","습관_평일"]
["수업복습","습관_평일"]
["민병철유폰","습관_평일"]
["어쩌다코딩","코딩"]
["엑셀월드","글쓰기"]
["SQL강의","공부"]